Reaction Details
TargetAlpha-1D adrenergic receptor
LigandBDBM50416774
Substrate/Competitorn/a
Meas. Tech.ChEMBL_658239 (CHEMBL1246631)
Ki 8.51±n/a nM
Citation Franchini, SPrandi, ABaraldi, ASorbi, CTait, ABuccioni, MMarucci, GCilia, APirona, LFossa, PCichero, EBrasili, L 1,3-Dioxolane-based ligands incorporating a lactam or imide moiety: structure-affinity/activity relationship at alpha1-adrenoceptor subtypes and at 5-HT1A receptors. Eur J Med Chem45:3740-51 (2010) 
 
Alpha-1D adrenergic receptor
Name:Alpha-1D adrenergic receptor
Type:Enzyme Catalytic Domain
Mol. Mass.:60485.82
Organism:Homo sapiens (Human)
Description:adrenergic Alpha1D ADRA1D HUMAN::P25100
Residue:572
BDBM50416774
NameBDBM50416774
Synonyms:CHEMBL1242819
TypeSmall organic molecule
Emp. Form.C27H33N3O5
Mol. Mass.479.568
SMILESCOc1ccccc1N1CCN(C[C@@H]2CO[C@](CN3C(=O)CCCC3=O)(O2)c2ccccc2)CC1