Reaction Details
Target5-hydroxytryptamine receptor 1A
LigandBDBM50416780
Substrate/Competitorn/a
Meas. Tech.ChEMBL_658240 (CHEMBL1246632)
Ki 5.13±n/a nM
Citation Franchini, SPrandi, ABaraldi, ASorbi, CTait, ABuccioni, MMarucci, GCilia, APirona, LFossa, PCichero, EBrasili, L 1,3-Dioxolane-based ligands incorporating a lactam or imide moiety: structure-affinity/activity relationship at alpha1-adrenoceptor subtypes and at 5-HT1A receptors. Eur J Med Chem45:3740-51 (2010) 
 
5-hydroxytryptamine receptor 1A
Name:5-hydroxytryptamine receptor 1A
Type:n/a
Mol. Mass.:46122.49
Organism:Homo sapiens (Human)
Description:n/a
Residue:422
BDBM50416780
NameBDBM50416780
Synonyms:CHEMBL1242542
TypeSmall organic molecule
Emp. Form.C27H35N3O4
Mol. Mass.465.5845
SMILESCOc1ccccc1N1CCN(C[C@@H]2CO[C@](CN3CCCCC3=O)(O2)c2ccccc2)CC1