Reaction Details
Target5-hydroxytryptamine receptor 1A
LigandBDBM50026917
Substrate/Competitorn/a
Meas. Tech.ChEMBL_658240 (CHEMBL1246632)
Ki 1.26±n/a nM
Citation Franchini, SPrandi, ABaraldi, ASorbi, CTait, ABuccioni, MMarucci, GCilia, APirona, LFossa, PCichero, EBrasili, L 1,3-Dioxolane-based ligands incorporating a lactam or imide moiety: structure-affinity/activity relationship at alpha1-adrenoceptor subtypes and at 5-HT1A receptors. Eur J Med Chem45:3740-51 (2010) 
 
5-hydroxytryptamine receptor 1A
Name:5-hydroxytryptamine receptor 1A
Type:n/a
Mol. Mass.:46122.49
Organism:Homo sapiens (Human)
Description:n/a
Residue:422
BDBM50026917
NameBDBM50026917
Synonyms:8-(2-(4-(2-methoxyphenyl)piperazin-1-yl)ethyl)-8-azaspiro[4.5]decane-7,9-dione 8-{2-[4-(2-Methoxy-phenyl)-piperazin-1-yl]-ethyl}-8-aza-spiro[4.5]decane-7,9-dione BMY 7378 CHEMBL1256934 CHEMBL543741
TypeSmall organic molecule
Emp. Form.C22H31N3O3
Mol. Mass.385.4998
SMILESCOc1ccccc1N1CCN(CCN2C(=O)CC3(CCCC3)CC2=O)CC1