Reaction Details
TargetAlpha-1B adrenergic receptor
LigandBDBM50416782
Substrate/Competitorn/a
Meas. Tech.ChEMBL_658238 (CHEMBL1246630)
Ki 18.2±n/a nM
Citation Franchini, SPrandi, ABaraldi, ASorbi, CTait, ABuccioni, MMarucci, GCilia, APirona, LFossa, PCichero, EBrasili, L 1,3-Dioxolane-based ligands incorporating a lactam or imide moiety: structure-affinity/activity relationship at alpha1-adrenoceptor subtypes and at 5-HT1A receptors. Eur J Med Chem45:3740-51 (2010) 
 
Alpha-1B adrenergic receptor
Name:Alpha-1B adrenergic receptor
Type:Enzyme
Mol. Mass.:56862.13
Organism:Homo sapiens (Human)
Description:P35368
Residue:520
BDBM50416782
NameBDBM50416782
Synonyms:CHEMBL1242633
TypeSmall organic molecule
Emp. Form.C28H37N3O4
Mol. Mass.479.6111
SMILESCOc1ccccc1N1CCN(C[C@@H]2CO[C@](CN3CCCCCC3=O)(O2)c2ccccc2)CC1