Reaction Details
TargetMembrane primary amine oxidase
LigandBDBM50105417
Substrate/Competitorn/a
Meas. Tech.ChEMBL_659975 (CHEMBL1247376)
IC50 19.95±n/a nM
Citation Nurminen, EMPihlavisto, MLázár, LSzakonyi, ZPentikäinen, UFülöp, FPentikäinen, OT Synthesis, in vitro activity, and three-dimensional quantitative structure-activity relationship of novel hydrazine inhibitors of human vascular adhesion protein-1. J Med Chem53:6301-15 (2010) 
 
Membrane primary amine oxidase
Name:Membrane primary amine oxidase
Type:Protein
Mol. Mass.:84620.86
Organism:Homo sapiens (Human)
Description:Q16853
Residue:763
BDBM50105417
NameBDBM50105417
Synonyms:CHEMBL1089 PHENELZINE | Phenethyl-hydrazine
TypeSmall organic molecule
Emp. Form.C8H12N2
Mol. Mass.136.1943
SMILESNNCCc1ccccc1