Reaction Details
TargetAndrogen receptor
LigandBDBM50172022
Substrate/Competitorn/a
Meas. Tech.ChEMBL_664242 (CHEMBL1261749)
IC50 158.49±n/a nM
Citation Jaroch, SBerger, MHuwe, CKrolikiewicz, KRehwinkel, HSchäcke, HSchmees, NSkuballa, W Discovery of quinolines as selective glucocorticoid receptor agonists. Bioorg Med Chem Lett20:5835-8 (2010) 
 
Androgen receptor
Name:Androgen receptor
Type:Receptor
Mol. Mass.:99185.27
Organism:Homo sapiens (Human)
Description:CHO cells were stably transfected with human AR gene.
Residue:920
BDBM50172022
NameBDBM50172022
Synonyms:4-(5-Fluoro-2-hydroxy-phenyl)-2-hydroxy-4-methyl-2-trifluoromethyl-pentanoic acid (4-methyl-1-oxo-1H-benzo[d][1,2]oxazin-6-yl)-amide | CHEMBL196374
TypeSmall organic molecule
Emp. Form.C22H20F4N2O5
Mol. Mass.468.3982
SMILESCc1noc(=O)c2ccc(NC(=O)C(O)(CC(C)(C)c3cc(F)ccc3O)C(F)(F)F)cc12