Reaction Details
TargetExtracellular calcium-sensing receptor
LigandBDBM50416881
Substrate/Competitorn/a
Meas. Tech.ChEMBL_664261 (CHEMBL1261768)
EC50 200±n/a nM
Citation Gustafsson, MJensen, JBertozzi, SMCurrier, EAMa, JNBurstein, ESOlsson, R Discovery of a class of calcium sensing receptor positive allosteric modulators; 1-(benzothiazol-2-yl)-1-phenylethanols. Bioorg Med Chem Lett20:5918-21 (2010) 
 
Extracellular calcium-sensing receptor
Name:Extracellular calcium-sensing receptor
Type:Protein
Mol. Mass.:120663.13
Organism:Homo sapiens (Human)
Description:P41180
Residue:1078
BDBM50416881
NameBDBM50416881
Synonyms:CHEMBL1258389
TypeSmall organic molecule
Emp. Form.C19H19NOS
Mol. Mass.309.425
SMILESCc1ccc(c(C)c1)C(O)(C1CC1)c1nc2ccccc2s1