Reaction Details
TargetExtracellular calcium-sensing receptor
LigandBDBM50416885
Substrate/Competitorn/a
Meas. Tech.ChEMBL_664261 (CHEMBL1261768)
EC50 630.96±n/a nM
Citation Gustafsson, MJensen, JBertozzi, SMCurrier, EAMa, JNBurstein, ESOlsson, R Discovery of a class of calcium sensing receptor positive allosteric modulators; 1-(benzothiazol-2-yl)-1-phenylethanols. Bioorg Med Chem Lett20:5918-21 (2010) 
 
Extracellular calcium-sensing receptor
Name:Extracellular calcium-sensing receptor
Type:Protein
Mol. Mass.:120663.13
Organism:Homo sapiens (Human)
Description:P41180
Residue:1078
BDBM50416885
NameBDBM50416885
Synonyms:CHEMBL1258390
TypeSmall organic molecule
Emp. Form.C19H15NOS
Mol. Mass.305.394
SMILESCC(O)(c1nc2ccccc2s1)c1ccc2ccccc2c1