Reaction Details
TargetNeuropeptide Y receptor type 5
LigandBDBM50417047
Substrate/Competitorn/a
Meas. Tech.ChEMBL_664979 (CHEMBL1259936)
Ki 0.2±n/a nM
Citation Leslie, CPBentley, JBiagetti, MContini, SDi Fabio, RDonati, DGenski, TGuery, SMazzali, AMerlo, GPizzi, DASacco, FSeri, CTessari, MZonzini, LCaberlotto, L Discovery and structure-activity relationship of a novel spirocarbamate series of NPY Y5 antagonists. Bioorg Med Chem Lett20:6103-7 (2010) 
 
Neuropeptide Y receptor type 5
Name:Neuropeptide Y receptor type 5
Type:Enzyme
Mol. Mass.:50746.64
Organism:Homo sapiens (Human)
Description:Q15761
Residue:445
BDBM50417047
NameBDBM50417047
Synonyms:CHEMBL1258454
TypeSmall organic molecule
Emp. Form.C22H23FN6O2
Mol. Mass.422.4554
SMILESFc1ccccc1-n1cc(NC[C@H]2CC[C@@]3(CN(C(=O)O3)c3ccnnc3)CC2)cn1