Reaction Details
TargetAcetylcholine-binding protein
LigandBDBM50417096
Substrate/Competitorn/a
Meas. Tech.ChEMBL_665339 (CHEMBL1261016)
Ki 5128.61±n/a nM
Citation de Kloe, GERetra, KGeitmann, MKällblad, PNahar, Tvan Elk, RSmit, ABvan Muijlwijk-Koezen, JELeurs, RIrth, HDanielson, UHde Esch, IJ Surface plasmon resonance biosensor based fragment screening using acetylcholine binding protein identifies ligand efficiency hot spots (LE hot spots) by deconstruction of nicotinic acetylcholine receptora7 ligands. J Med Chem53:7192-201 (2010) 
 
Acetylcholine-binding protein
Name:Acetylcholine-binding protein
Type:n/a
Mol. Mass.:26055.52
Organism:Lymnaea stagnalis
Description:Soluble acetylcholine receptor
Residue:229
BDBM50417096
NameBDBM50417096
Synonyms:CHEMBL1256000
TypeSmall organic molecule
Emp. Form.C14H18BrN3O
Mol. Mass.324.216
SMILESBrc1ccc(NC(=O)N[C@H]2CN3CCC2CC3)cc1