Reaction Details
TargetAcetylcholine-binding protein
LigandBDBM50417097
Substrate/Competitorn/a
Meas. Tech.ChEMBL_665339 (CHEMBL1261016)
Ki 467.74±n/a nM
Citation de Kloe, GERetra, KGeitmann, MKällblad, PNahar, Tvan Elk, RSmit, ABvan Muijlwijk-Koezen, JELeurs, RIrth, HDanielson, UHde Esch, IJ Surface plasmon resonance biosensor based fragment screening using acetylcholine binding protein identifies ligand efficiency hot spots (LE hot spots) by deconstruction of nicotinic acetylcholine receptora7 ligands. J Med Chem53:7192-201 (2010) 
 
Acetylcholine-binding protein
Name:Acetylcholine-binding protein
Type:n/a
Mol. Mass.:26055.52
Organism:Lymnaea stagnalis
Description:Soluble acetylcholine receptor
Residue:229
BDBM50417097
NameBDBM50417097
Synonyms:CHEMBL1256002
TypeSmall organic molecule
Emp. Form.C13H19N3
Mol. Mass.217.3101
SMILESN[C@@H]1C2CCN(CC2)[C@H]1Cc1cccnc1