Reaction Details
TargetNeuronal acetylcholine receptor subunit alpha-7
LigandBDBM50393248
Substrate/Competitorn/a
Meas. Tech.ChEMBL_665340 (CHEMBL1261017)
Ki 13.18±n/a nM
Citation de Kloe, GERetra, KGeitmann, MKällblad, PNahar, Tvan Elk, RSmit, ABvan Muijlwijk-Koezen, JELeurs, RIrth, HDanielson, UHde Esch, IJ Surface plasmon resonance biosensor based fragment screening using acetylcholine binding protein identifies ligand efficiency hot spots (LE hot spots) by deconstruction of nicotinic acetylcholine receptora7 ligands. J Med Chem53:7192-201 (2010) 
 
Neuronal acetylcholine receptor subunit alpha-7
Name:Neuronal acetylcholine receptor subunit alpha-7
Type:n/a
Mol. Mass.:56448.33
Organism:Homo sapiens (Human)
Description: CHRNA7 (NACHRA7)
Residue:502
BDBM50393248
NameBDBM50393248
Synonyms:CHEMBL1258005
TypeSmall organic molecule
Emp. Form.C20H22BrN3O
Mol. Mass.400.312
SMILESBrc1ccc(cc1)C(=O)N[C@@H]1C2CCN(CC2)[C@H]1Cc1cccnc1