Reaction Details
TargetNeuronal acetylcholine receptor subunit alpha-7
LigandBDBM50417094
Substrate/Competitorn/a
Meas. Tech.ChEMBL_665340 (CHEMBL1261017)
Ki 1949.84±n/a nM
Citation de Kloe, GERetra, KGeitmann, MKällblad, PNahar, Tvan Elk, RSmit, ABvan Muijlwijk-Koezen, JELeurs, RIrth, HDanielson, UHde Esch, IJ Surface plasmon resonance biosensor based fragment screening using acetylcholine binding protein identifies ligand efficiency hot spots (LE hot spots) by deconstruction of nicotinic acetylcholine receptora7 ligands. J Med Chem53:7192-201 (2010) 
 
Neuronal acetylcholine receptor subunit alpha-7
Name:Neuronal acetylcholine receptor subunit alpha-7
Type:n/a
Mol. Mass.:56448.33
Organism:Homo sapiens (Human)
Description: CHRNA7 (NACHRA7)
Residue:502
BDBM50417094
NameBDBM50417094
Synonyms:CHEMBL1255907
TypeSmall organic molecule
Emp. Form.C14H18N2O2
Mol. Mass.246.3049
SMILESO=C(Nc1ccccc1)O[C@H]1CN2CCC1CC2