Reaction Details
TargetAcetylcholine-binding protein
LigandBDBM50119572
Substrate/Competitorn/a
Meas. Tech.ChEMBL_665337 (CHEMBL1261014)
Kd 6026±n/a nM
Citation de Kloe, GERetra, KGeitmann, MKällblad, PNahar, Tvan Elk, RSmit, ABvan Muijlwijk-Koezen, JELeurs, RIrth, HDanielson, UHde Esch, IJ Surface plasmon resonance biosensor based fragment screening using acetylcholine binding protein identifies ligand efficiency hot spots (LE hot spots) by deconstruction of nicotinic acetylcholine receptora7 ligands. J Med Chem53:7192-201 (2010) 
 
Acetylcholine-binding protein
Name:Acetylcholine-binding protein
Type:n/a
Mol. Mass.:26055.52
Organism:Lymnaea stagnalis
Description:Soluble acetylcholine receptor
Residue:229
BDBM50119572
NameBDBM50119572
Synonyms:CHEMBL142049 Quinuclidine analogue, 1
TypeSmall organic molecule
Emp. Form.C9H14N2
Mol. Mass.150.2209
SMILESCN(C)CCc1cccnc1