Reaction Details
TargetP2X purinoceptor 7
LigandBDBM50417274
Substrate/Competitorn/a
Meas. Tech.ChEMBL_676096 (CHEMBL1273090)
IC50 2±n/a nM
Citation Abberley, LBebius, ABeswick, PJBillinton, ACollis, KLDean, DKFonfria, EGleave, RJMedhurst, SJMichel, ADMoses, APPatel, SRoman, SAScoccitti, TSmith, BSteadman, JGWalter, DS Identification of 2-oxo-N-(phenylmethyl)-4-imidazolidinecarboxamide antagonists of the P2X(7) receptor. Bioorg Med Chem Lett20:6370-4 (2010) 
 
P2X purinoceptor 7
Name:P2X purinoceptor 7
Type:Protein
Mol. Mass.:68602.85
Organism:Homo sapiens (Human)
Description:Q99572
Residue:595
BDBM50417274
NameBDBM50417274
Synonyms:CHEMBL1269248
TypeSmall organic molecule
Emp. Form.C13H15Cl2N3O2
Mol. Mass.316.183
SMILESCN1C[C@H](N(C)C1=O)C(=O)NCc1ccc(Cl)cc1Cl