Reaction Details
TargetAlpha-2A adrenergic receptor
LigandBDBM50417354
Substrate/Competitorn/a
Meas. Tech.ChEMBL_684814 (CHEMBL1285951)
EC50 74±n/a nM
Citation Del Bello, FMattioli, LGhelfi, FGiannella, MPiergentili, AQuaglia, WCardinaletti, CPerfumi, MThomas, RJZanelli, UMarchioro, CDal Cin, MPigini, M Fruitful adrenergica(2C)-agonism/a(2A)-antagonism combination to prevent and contrast morphine tolerance and dependence. J Med Chem53:7825-35 (2010) 
 
Alpha-2A adrenergic receptor
Name:Alpha-2A adrenergic receptor
Type:Enzyme
Mol. Mass.:48979.91
Organism:Homo sapiens (Human)
Description:P08913
Residue:450
BDBM50417354
NameBDBM50417354
Synonyms:CHEMBL396013
TypeSmall organic molecule
Emp. Form.C17H18N2O
Mol. Mass.266.3376
SMILESC[C@H](Oc1ccccc1-c1ccccc1)C1=NCCN1