Reaction Details
TargetBcl-2-like protein 1
LigandBDBM21444
Substrate/Competitorn/a
Meas. Tech.ChEMBL_687845 (CHEMBL1291409)
EC50 29.99±n/a nM
Citation Almerico, AMTutone, MLauria, A 3D-QSAR pharmacophore modeling and in silico screening of new Bcl-xl inhibitors. Eur J Med Chem45:4774-82 (2010) 
 
Bcl-2-like protein 1
Name:Bcl-2-like protein 1
Type:Mitochondrion membrane; Single-pass membrane protein
Mol. Mass.:26039.60
Organism:Homo sapiens (Human)
Description:n/a
Residue:233
BDBM21444
NameBDBM21444
Synonyms:N-Benylpiperazine derivative, 23m | N-[(4-{[(2R)-4-(dimethylamino)-1-(phenylsulfanyl)butan-2-yl]amino}-3-nitrobenzene)sulfonyl]-4-(4-{[2-(4-methoxyphenyl)phenyl]methyl}piperazin-1-yl)benzamide
TypeSmall organic molecule
Emp. Form.C43H48N6O6S2
Mol. Mass.809.008
SMILESCOc1ccc(cc1)-c1ccccc1CN1CCN(CC1)c1ccc(cc1)C(=O)NS(=O)(=O)c1ccc(N[C@H](CCN(C)C)CSc2ccccc2)c(c1)[N+]([O-])=O