Reaction Details
TargetNeuropeptide Y receptor type 5
LigandBDBM50417402
Substrate/Competitorn/a
Meas. Tech.ChEMBL_686319 (CHEMBL1293075)
Ki 0.631±n/a nM
Citation Pizzi, DALeslie, CPMazzali, ASeri, CBiagetti, MBentley, JGenski, TDi Fabio, RContini, SSabbatini, FMZonzini, LCaberlotto, L Design, synthesis and SAR of a novel series of benzimidazoles as potent NPY Y5 antagonists. Bioorg Med Chem Lett20:7120-3 (2010) 
 
Neuropeptide Y receptor type 5
Name:Neuropeptide Y receptor type 5
Type:Enzyme
Mol. Mass.:50746.64
Organism:Homo sapiens (Human)
Description:Q15761
Residue:445
BDBM50417402
NameBDBM50417402
Synonyms:CHEMBL1289820
TypeSmall organic molecule
Emp. Form.C22H20F3N3O2
Mol. Mass.415.4083
SMILESFC(F)(F)c1ccc2nc([nH]c2c1)[C@H]1CC[C@@]2(CN(C(=O)O2)c2ccccc2)CC1