Reaction Details
TargetNeuropeptide Y receptor type 5
LigandBDBM50417406
Substrate/Competitorn/a
Meas. Tech.ChEMBL_686319 (CHEMBL1293075)
Ki 0.316±n/a nM
Citation Pizzi, DALeslie, CPMazzali, ASeri, CBiagetti, MBentley, JGenski, TDi Fabio, RContini, SSabbatini, FMZonzini, LCaberlotto, L Design, synthesis and SAR of a novel series of benzimidazoles as potent NPY Y5 antagonists. Bioorg Med Chem Lett20:7120-3 (2010) 
 
Neuropeptide Y receptor type 5
Name:Neuropeptide Y receptor type 5
Type:Enzyme
Mol. Mass.:50746.64
Organism:Homo sapiens (Human)
Description:Q15761
Residue:445
BDBM50417406
NameBDBM50417406
Synonyms:CHEMBL1290037
TypeSmall organic molecule
Emp. Form.C22H20N4O2
Mol. Mass.372.4198
SMILESO=C1O[C@@]2(CN1c1ccccc1)CC[C@@H](CC2)c1nc2ccc(cc2[nH]1)C#N