Reaction Details
TargetTranscriptional regulator ERG
LigandBDBM50417422
Substrate/Competitorn/a
Meas. Tech.ChEMBL_686392 (CHEMBL1293148)
Ki 3981.07±n/a nM
Citation Bromidge, SMArban, RBertani, BBorriello, MCapelli, AMDi-Fabio, RFaedo, SGianotti, MGordon, LJGranci, EPasquarello, ASpada, SKWorby, AZonzini, LZucchelli, V 5-{2-[4-(2-methyl-5-quinolinyl)-1-piperazinyl]ethyl}-2(1H)-quinolinones and 3,4-dihydro-2(1H)-quinolinones: dual-acting 5-HT1 receptor antagonists and serotonin reuptake inhibitors. Part 3. Bioorg Med Chem Lett20:7092-6 (2010) 
 
Transcriptional regulator ERG
Name:Transcriptional regulator ERG
Type:PROTEIN
Mol. Mass.:54615.84
Organism:Homo sapiens (Human)
Description:ChEMBL_1335569
Residue:486
BDBM50417422
NameBDBM50417422
Synonyms:CHEMBL1289048
TypeSmall organic molecule
Emp. Form.C27H30N4O
Mol. Mass.426.5533
SMILESCc1ccc2c(cccc2n1)N1CCN(CCc2c(C)ccc3n(C)c(=O)ccc23)CC1