Reaction Details
Target5-hydroxytryptamine receptor 1A
LigandBDBM50417426
Substrate/Competitorn/a
Meas. Tech.ChEMBL_686385 (CHEMBL1293141)
Ki 1.26±n/a nM
Citation Bromidge, SMArban, RBertani, BBorriello, MCapelli, AMDi-Fabio, RFaedo, SGianotti, MGordon, LJGranci, EPasquarello, ASpada, SKWorby, AZonzini, LZucchelli, V 5-{2-[4-(2-methyl-5-quinolinyl)-1-piperazinyl]ethyl}-2(1H)-quinolinones and 3,4-dihydro-2(1H)-quinolinones: dual-acting 5-HT1 receptor antagonists and serotonin reuptake inhibitors. Part 3. Bioorg Med Chem Lett20:7092-6 (2010) 
 
5-hydroxytryptamine receptor 1A
Name:5-hydroxytryptamine receptor 1A
Type:n/a
Mol. Mass.:46122.49
Organism:Homo sapiens (Human)
Description:n/a
Residue:422
BDBM50417426
NameBDBM50417426
Synonyms:CHEMBL1289721
TypeSmall organic molecule
Emp. Form.C28H31N3O
Mol. Mass.425.5652
SMILESCc1ccc2c(cccc2n1)C1CCN(CCc2c(C)ccc3n(C)c(=O)ccc23)CC1