Reaction Details
Target5-hydroxytryptamine receptor 1D
LigandBDBM50417412
Substrate/Competitorn/a
Meas. Tech.ChEMBL_686387 (CHEMBL1293143)
Ki 2.51±n/a nM
Citation Bromidge, SMArban, RBertani, BBorriello, MCapelli, AMDi-Fabio, RFaedo, SGianotti, MGordon, LJGranci, EPasquarello, ASpada, SKWorby, AZonzini, LZucchelli, V 5-{2-[4-(2-methyl-5-quinolinyl)-1-piperazinyl]ethyl}-2(1H)-quinolinones and 3,4-dihydro-2(1H)-quinolinones: dual-acting 5-HT1 receptor antagonists and serotonin reuptake inhibitors. Part 3. Bioorg Med Chem Lett20:7092-6 (2010) 
 
5-hydroxytryptamine receptor 1D
Name:5-hydroxytryptamine receptor 1D
Type:G Protein-Coupled Receptor (GPCR)
Mol. Mass.:41920.63
Organism:Homo sapiens (Human)
Description:Receptor binding assays were performed using human clone stably expressed in CHO cells.
Residue:377
BDBM50417412
NameBDBM50417412
Synonyms:CHEMBL1289047
TypeSmall organic molecule
Emp. Form.C26H28N4O
Mol. Mass.412.5267
SMILESCc1ccc2c(cccc2n1)N1CCN(CCc2c(C)ccc3[nH]c(=O)ccc23)CC1