Reaction Details
TargetMuscarinic acetylcholine receptor M3
LigandBDBM50296331
Substrate/Competitorn/a
Meas. Tech.ChEMBL_687865 (CHEMBL1291429)
IC50 0.126±n/a nM
Citation Stocks, MJAlcaraz, LBailey, ABowers, KDonald, DEdwards, HHunt, FKindon, NPairaudeau, GTheaker, JWarner, DJ The discovery of new spirocyclic muscarinic M3 antagonists. Bioorg Med Chem Lett20:7458-61 (2010) 
 
Muscarinic acetylcholine receptor M3
Name:Muscarinic acetylcholine receptor M3
Type:Enzyme
Mol. Mass.:66151.03
Organism:Homo sapiens (Human)
Description:P20309
Residue:590
BDBM50296331
NameBDBM50296331
Synonyms:(3R)-3-{[Hydroxy(di-2-thienyl)acetyl]oxy}-1-(3-phenoxypropyl)-1-azoniabicyclo[2.2.2]octane bromide Aclidinium Tudorza Pressair US9687478, 44
TypeSmall organic molecule
Emp. Form.C26H30NO4S2
Mol. Mass.484.65
SMILESOC(C(=O)O[C@H]1C[N+]2(CCCOc3ccccc3)CCC1CC2)(c1cccs1)c1cccs1