Reaction Details
TargetVitamin D3 receptor
LigandBDBM50417514
Substrate/Competitorn/a
Meas. Tech.ChEMBL_695917 (CHEMBL1641104)
Ki 0.2±n/a nM
Citation Grzywacz, PChiellini, GPlum, LAClagett-Dame, MDeLuca, HF Removal of the 26-methyl group from 19-nor-1a,25-dihydroxyvitamin D3 markedly reduces in vivo calcemic activity without altering in vitro VDR binding, HL-60 cell differentiation, and transcription. J Med Chem53:8642-9 (2010) 
 
Vitamin D3 receptor
Name:Vitamin D3 receptor
Type:PROTEIN
Mol. Mass.:47811.07
Organism:Rattus norvegicus
Description:ChEMBL_1505946
Residue:423
BDBM50417514
NameBDBM50417514
Synonyms:CHEMBL1630754
TypeSmall organic molecule
Emp. Form.C26H42O3
Mol. Mass.402.6099
SMILES[#6]-[#6@@H](-[#8])-[#6]-[#6]-[#6]-[#6@@H](-[#6])-[#6@H]1-[#6]-[#6]-[#6@H]2\[#6](-[#6]-[#6]-[#6][C@]12[#6])=[#6]\[#6]=[#6]-1/[#6]-[#6@@H](-[#8])-[#6](=[#6])-[#6@H](-[#8])-[#6]-1