Reaction Details
TargetAlpha-1D adrenergic receptor
LigandBDBM50417541
Substrate/Competitorn/a
Meas. Tech.ChEMBL_693739 (CHEMBL1638258)
Ki 0.245±n/a nM
Citation Sagratini, GAngeli, PBuccioni, MGulini, UMarucci, GMelchiorre, CPoggesi, EGiardinà, D Synthesis anda1-adrenoceptor antagonist activity of tamsulosin analogues. Eur J Med Chem45:5800-7 (2010) 
 
Alpha-1D adrenergic receptor
Name:Alpha-1D adrenergic receptor
Type:Enzyme Catalytic Domain
Mol. Mass.:60485.82
Organism:Homo sapiens (Human)
Description:adrenergic Alpha1D ADRA1D HUMAN::P25100
Residue:572
BDBM50417541
NameBDBM50417541
Synonyms:CHEMBL1630938
TypeSmall organic molecule
Emp. Form.C21H30N2O5S
Mol. Mass.422.538
SMILESCOc1ccc(C[C@@H](C)NCCOc2ccccc2OC(C)C)cc1S(N)(=O)=O