Reaction Details
TargetDelta-type opioid receptor
LigandBDBM50417584
Substrate/Competitorn/a
Meas. Tech.ChEMBL_699953 (CHEMBL1646360)
Ki 158±n/a nM
Citation Zhang, CWestaway, SMSpeake, JDBishop, MJGoetz, ASCarballo, LHHu, MEpperly, AH Tetrahydroquinoline derivatives as opioid receptor antagonists. Bioorg Med Chem Lett21:670-6 (2011) 
 
Delta-type opioid receptor
Name:Delta-type opioid receptor
Type:G Protein-Coupled Receptor (GPCR)
Mol. Mass.:40382.98
Organism:Homo sapiens (Human)
Description:Competition binding assays were carried out using membrane preparations from transfected HN9.10 cells that constitutively expressed the delta opioid receptor.
Residue:372
BDBM50417584
NameBDBM50417584
Synonyms:CHEMBL1642742
TypeSmall organic molecule
Emp. Form.C25H31N3O
Mol. Mass.389.5331
SMILESNC(=O)c1ccc2N(CCCc2c1)c1ccc(CNCCC2=CCCCC2)cc1