Reaction Details
TargetDelta-type opioid receptor
LigandBDBM50417601
Substrate/Competitorn/a
Meas. Tech.ChEMBL_699953 (CHEMBL1646360)
Ki 501±n/a nM
Citation Zhang, CWestaway, SMSpeake, JDBishop, MJGoetz, ASCarballo, LHHu, MEpperly, AH Tetrahydroquinoline derivatives as opioid receptor antagonists. Bioorg Med Chem Lett21:670-6 (2011) 
 
Delta-type opioid receptor
Name:Delta-type opioid receptor
Type:G Protein-Coupled Receptor (GPCR)
Mol. Mass.:40382.98
Organism:Homo sapiens (Human)
Description:Competition binding assays were carried out using membrane preparations from transfected HN9.10 cells that constitutively expressed the delta opioid receptor.
Residue:372
BDBM50417601
NameBDBM50417601
Synonyms:CHEMBL1642760
TypeSmall organic molecule
Emp. Form.C26H33N3O
Mol. Mass.403.5597
SMILESCc1cc(ccc1CNCCC1=CCCCC1)N1CCCc2cc(ccc12)C(N)=O