Reaction Details
TargetDelta-type opioid receptor
LigandBDBM50000787
Substrate/Competitorn/a
Meas. Tech.ChEMBL_699953 (CHEMBL1646360)
Ki 25±n/a nM
Citation Zhang, CWestaway, SMSpeake, JDBishop, MJGoetz, ASCarballo, LHHu, MEpperly, AH Tetrahydroquinoline derivatives as opioid receptor antagonists. Bioorg Med Chem Lett21:670-6 (2011) 
 
Delta-type opioid receptor
Name:Delta-type opioid receptor
Type:G Protein-Coupled Receptor (GPCR)
Mol. Mass.:40382.98
Organism:Homo sapiens (Human)
Description:Competition binding assays were carried out using membrane preparations from transfected HN9.10 cells that constitutively expressed the delta opioid receptor.
Residue:372
BDBM50000787
NameBDBM50000787
Synonyms:(1S,5R,13R,17S)-4-(cyclopropylmethyl)-10,17-dihydroxy-12-oxa-4-azapentacyclo[9.6.1.0^{1,13}.0^{5,17}.0^{7,18}]octadeca-7(18),8,10-trien-14-one | NALTREXONE
TypeSmall organic molecule
Emp. Form.C20H23NO4
Mol. Mass.341.4009
SMILESOc1ccc2C[C@H]3N(CC4CC4)CC[C@@]45[C@@H](Oc1c24)C(=O)CC[C@@]35O