Reaction Details
TargetMu-type opioid receptor
LigandBDBM50417591
Substrate/Competitorn/a
Meas. Tech.ChEMBL_699952 (CHEMBL1646359)
Ki 126±n/a nM
Citation Zhang, CWestaway, SMSpeake, JDBishop, MJGoetz, ASCarballo, LHHu, MEpperly, AH Tetrahydroquinoline derivatives as opioid receptor antagonists. Bioorg Med Chem Lett21:670-6 (2011) 
 
Mu-type opioid receptor
Name:Mu-type opioid receptor
Type:G Protein-Coupled Receptor (GPCR)
Mol. Mass.:44789.51
Organism:Homo sapiens (Human)
Description:P35372
Residue:400
BDBM50417591
NameBDBM50417591
Synonyms:CHEMBL1642749
TypeSmall organic molecule
Emp. Form.C24H31N3O2
Mol. Mass.393.5218
SMILESNC(=O)c1ccc2N(CCCc2c1)c1ccc(CNCCC2CCOCC2)cc1