Reaction Details
TargetMu-type opioid receptor
LigandBDBM50417592
Substrate/Competitorn/a
Meas. Tech.ChEMBL_699952 (CHEMBL1646359)
Ki<3981±n/a nM
Citation Zhang, CWestaway, SMSpeake, JDBishop, MJGoetz, ASCarballo, LHHu, MEpperly, AH Tetrahydroquinoline derivatives as opioid receptor antagonists. Bioorg Med Chem Lett21:670-6 (2011) 
 
Mu-type opioid receptor
Name:Mu-type opioid receptor
Type:G Protein-Coupled Receptor (GPCR)
Mol. Mass.:44789.51
Organism:Homo sapiens (Human)
Description:P35372
Residue:400
BDBM50417592
NameBDBM50417592
Synonyms:CHEMBL1642750
TypeSmall organic molecule
Emp. Form.C27H36N4O2
Mol. Mass.448.6003
SMILESNC(=O)c1ccc2N(CCCc2c1)c1ccc(CNC2CCN(CC2)C2CCOCC2)cc1