Reaction Details
TargetKappa-type opioid receptor
LigandBDBM50417598
Substrate/Competitorn/a
Meas. Tech.ChEMBL_699954 (CHEMBL1646361)
Ki 200±n/a nM
Citation Zhang, CWestaway, SMSpeake, JDBishop, MJGoetz, ASCarballo, LHHu, MEpperly, AH Tetrahydroquinoline derivatives as opioid receptor antagonists. Bioorg Med Chem Lett21:670-6 (2011) 
 
Kappa-type opioid receptor
Name:Kappa-type opioid receptor
Type:G Protein-Coupled Receptor (GPCR)
Mol. Mass.:42648.76
Organism:Homo sapiens (Human)
Description:P41145
Residue:380
BDBM50417598
NameBDBM50417598
Synonyms:CHEMBL1642757
TypeSmall organic molecule
Emp. Form.C26H26ClN3O
Mol. Mass.431.957
SMILESNC(=O)c1ccc2N(CCCc2c1)c1ccc(CNC2Cc3ccccc3C2)c(Cl)c1