Reaction Details
TargetMu-type opioid receptor
LigandBDBM50417604
Substrate/Competitorn/a
Meas. Tech.ChEMBL_699952 (CHEMBL1646359)
Ki 1995±n/a nM
Citation Zhang, CWestaway, SMSpeake, JDBishop, MJGoetz, ASCarballo, LHHu, MEpperly, AH Tetrahydroquinoline derivatives as opioid receptor antagonists. Bioorg Med Chem Lett21:670-6 (2011) 
 
Mu-type opioid receptor
Name:Mu-type opioid receptor
Type:G Protein-Coupled Receptor (GPCR)
Mol. Mass.:44789.51
Organism:Homo sapiens (Human)
Description:P35372
Residue:400
BDBM50417604
NameBDBM50417604
Synonyms:CHEMBL1642752
TypeSmall organic molecule
Emp. Form.C25H29N3O2
Mol. Mass.403.5167
SMILESNC(=O)c1ccc2N(CCCc2c1)c1cccc(c1)C(=O)NCCC1=CCCCC1