Reaction Details
TargetPotassium voltage-gated channel subfamily H member 2
LigandBDBM50417667
Substrate/Competitorn/a
Meas. Tech.ChEMBL_700343 (CHEMBL1647669)
Ki 794.33±n/a nM
Citation Ray, PWright, JAdam, JBennett, JBoucharens, SBlack, DCook, ABrown, AREpemolu, OFletcher, DHaunso, AHuggett, MJones, PLaats, SLyons, AMestres, Jde Man, JMorphy, RRankovic, ZSherborne, BSherry, Lvan Straten, NWestwood, PZaman, GZ Fragment-based discovery of 6-substituted isoquinolin-1-amine based ROCK-I inhibitors. Bioorg Med Chem Lett21:97-101 (2010) 
 
Potassium voltage-gated channel subfamily H member 2
Name:Potassium voltage-gated channel subfamily H member 2
Type:Multi-pass membrane protein
Mol. Mass.:126672.65
Organism:Homo sapiens (Human)
Description:Q12809
Residue:1159
BDBM50417667
NameBDBM50417667
Synonyms:CHEMBL1643574
TypeSmall organic molecule
Emp. Form.C21H23N3O
Mol. Mass.333.4268
SMILESNc1nccc2cc(O[C@H]3CCCN(Cc4ccccc4)C3)ccc12