Reaction Details
TargetPotassium voltage-gated channel subfamily H member 2
LigandBDBM14029
Substrate/Competitorn/a
Meas. Tech.ChEMBL_700343 (CHEMBL1647669)
Ki 79432.82±n/a nM
Citation Ray, PWright, JAdam, JBennett, JBoucharens, SBlack, DCook, ABrown, AREpemolu, OFletcher, DHaunso, AHuggett, MJones, PLaats, SLyons, AMestres, Jde Man, JMorphy, RRankovic, ZSherborne, BSherry, Lvan Straten, NWestwood, PZaman, GZ Fragment-based discovery of 6-substituted isoquinolin-1-amine based ROCK-I inhibitors. Bioorg Med Chem Lett21:97-101 (2010) 
 
Potassium voltage-gated channel subfamily H member 2
Name:Potassium voltage-gated channel subfamily H member 2
Type:Multi-pass membrane protein
Mol. Mass.:126672.65
Organism:Homo sapiens (Human)
Description:Q12809
Residue:1159
BDBM14029
NameBDBM14029
Synonyms:(R)-TRANS-4-(1-AMINOETHYL)-N-(4-PYRIDYL) CYCLOHEXANECARBOXAMIDE US10183931, Y-27632 | Y-27632
TypeSmall organic molecule
Emp. Form.C14H21N3O
Mol. Mass.247.336
SMILES[H][C@@]1(CC[C@@]([H])(CC1)C(=O)Nc1ccncc1)[C@@H](C)N