Reaction Details
TargetRho-associated protein kinase 1
LigandBDBM50417678
Substrate/Competitorn/a
Meas. Tech.ChEMBL_700338 (CHEMBL1647664)
IC50 575.44±n/a nM
Citation Ray, PWright, JAdam, JBennett, JBoucharens, SBlack, DCook, ABrown, AREpemolu, OFletcher, DHaunso, AHuggett, MJones, PLaats, SLyons, AMestres, Jde Man, JMorphy, RRankovic, ZSherborne, BSherry, Lvan Straten, NWestwood, PZaman, GZ Fragment-based discovery of 6-substituted isoquinolin-1-amine based ROCK-I inhibitors. Bioorg Med Chem Lett21:97-101 (2010) 
 
Rho-associated protein kinase 1
Name:Rho-associated protein kinase 1
Type:Serine/threonine-protein kinase
Mol. Mass.:158156.77
Organism:Homo sapiens (Human)
Description:Q13464
Residue:1354
BDBM50417678
NameBDBM50417678
Synonyms:CHEMBL1643365
TypeSmall organic molecule
Emp. Form.C23H21N3O
Mol. Mass.355.4323
SMILESNc1nccc2cc(CNCc3cccc(Oc4ccccc4)c3)ccc12