Reaction Details
TargetRho-associated protein kinase 1
LigandBDBM50417681
Substrate/Competitorn/a
Meas. Tech.ChEMBL_700338 (CHEMBL1647664)
IC50 1949.84±n/a nM
Citation Ray, PWright, JAdam, JBennett, JBoucharens, SBlack, DCook, ABrown, AREpemolu, OFletcher, DHaunso, AHuggett, MJones, PLaats, SLyons, AMestres, Jde Man, JMorphy, RRankovic, ZSherborne, BSherry, Lvan Straten, NWestwood, PZaman, GZ Fragment-based discovery of 6-substituted isoquinolin-1-amine based ROCK-I inhibitors. Bioorg Med Chem Lett21:97-101 (2010) 
 
Rho-associated protein kinase 1
Name:Rho-associated protein kinase 1
Type:Serine/threonine-protein kinase
Mol. Mass.:158156.77
Organism:Homo sapiens (Human)
Description:Q13464
Residue:1354
BDBM50417681
NameBDBM50417681
Synonyms:CHEMBL1643571
TypeSmall organic molecule
Emp. Form.C14H17N3O
Mol. Mass.243.3043
SMILESNc1nccc2cc(O[C@@H]3CCCNC3)ccc12