Reaction Details
TargetRho-associated protein kinase 1
LigandBDBM14031
Substrate/Competitorn/a
Meas. Tech.ChEMBL_700338 (CHEMBL1647664)
IC50 758.58±n/a nM
Citation Ray, PWright, JAdam, JBennett, JBoucharens, SBlack, DCook, ABrown, AREpemolu, OFletcher, DHaunso, AHuggett, MJones, PLaats, SLyons, AMestres, Jde Man, JMorphy, RRankovic, ZSherborne, BSherry, Lvan Straten, NWestwood, PZaman, GZ Fragment-based discovery of 6-substituted isoquinolin-1-amine based ROCK-I inhibitors. Bioorg Med Chem Lett21:97-101 (2010) 
 
Rho-associated protein kinase 1
Name:Rho-associated protein kinase 1
Type:Serine/threonine-protein kinase
Mol. Mass.:158156.77
Organism:Homo sapiens (Human)
Description:Q13464
Residue:1354
BDBM14031
NameBDBM14031
Synonyms:5-(1,4-diazepane-1-sulfonyl)-1,2-dihydroisoquinolin-1-one HA-1100 | Hydroxyfasudil
TypeSmall organic molecule
Emp. Form.C14H17N3O3S
Mol. Mass.307.368
SMILESO=c1[nH]ccc2c(cccc12)S(=O)(=O)N1CCCNCC1