Reaction Details
TargetProstaglandin D2 receptor
LigandBDBM50417773
Substrate/Competitorn/a
Meas. Tech.ChEMBL_701282 (CHEMBL1648902)
IC50 0.501±n/a nM
Citation Mu, LAguiar, JArdati, ACao, BGardner, CJGillespy, THarris, KLim, SMarcus, RMorize, IParkar, AStefany, DLi, YVaz, RJCirovic, DA Understanding DP receptor antagonism using a CoMSIA approach. Bioorg Med Chem Lett21:66-75 (2010) 
 
Prostaglandin D2 receptor
Name:Prostaglandin D2 receptor
Type:Enzyme
Mol. Mass.:40288.87
Organism:Homo sapiens (Human)
Description:Q13258
Residue:359
BDBM50417773
NameBDBM50417773
Synonyms:CHEMBL1644253
TypeSmall organic molecule
Emp. Form.C22H23N7O3
Mol. Mass.433.4631
SMILESCOc1ccc(CCNc2cc(nc(OC)n2)-c2ccc(OC)c(c2)-c2nnn[nH]2)cc1