Reaction Details
TargetRho-associated protein kinase 1
LigandBDBM50417842
Substrate/Competitorn/a
Meas. Tech.ChEMBL_716636 (CHEMBL1670415)
IC50 331.13±n/a nM
Citation Ray, PWright, JAdam, JBoucharens, SBlack, DBrown, AREpemolu, OFletcher, DHuggett, MJones, PLaats, SLyons, Ade Man, JMorphy, RSherborne, BSherry, LStraten, NvWestwood, PYork, M Optimisation of 6-substituted isoquinolin-1-amine based ROCK-I inhibitors. Bioorg Med Chem Lett21:1084-8 (2011) 
 
Rho-associated protein kinase 1
Name:Rho-associated protein kinase 1
Type:Serine/threonine-protein kinase
Mol. Mass.:158156.77
Organism:Homo sapiens (Human)
Description:Q13464
Residue:1354
BDBM50417842
NameBDBM50417842
Synonyms:CHEMBL1667965
TypeSmall organic molecule
Emp. Form.C21H22N2O
Mol. Mass.318.4122
SMILESC(N1CCC[C@@H](C1)Oc1ccc2cnccc2c1)c1ccccc1