Reaction Details
TargetProtein kinase C epsilon type
LigandBDBM50417843
Substrate/Competitorn/a
Meas. Tech.ChEMBL_716671 (CHEMBL1670496)
IC50 398.11±n/a nM
Citation Ray, PWright, JAdam, JBoucharens, SBlack, DBrown, AREpemolu, OFletcher, DHuggett, MJones, PLaats, SLyons, Ade Man, JMorphy, RSherborne, BSherry, LStraten, NvWestwood, PYork, M Optimisation of 6-substituted isoquinolin-1-amine based ROCK-I inhibitors. Bioorg Med Chem Lett21:1084-8 (2011) 
 
Protein kinase C epsilon type
Name:Protein kinase C epsilon type
Type:Enzyme
Mol. Mass.:83680.45
Organism:Homo sapiens (Human)
Description:The recombinant human PKC enzymes were produced using a baculovirus expression system in SF9 cells
Residue:737
BDBM50417843
NameBDBM50417843
Synonyms:CHEMBL1667967
TypeSmall organic molecule
Emp. Form.C14H16N2O2
Mol. Mass.244.289
SMILESO=c1[nH]ccc2cc(O[C@H]3CCCNC3)ccc12