Reaction Details
TargetcAMP-dependent protein kinase catalytic subunit PRKX
LigandBDBM50417844
Substrate/Competitorn/a
Meas. Tech.ChEMBL_716673 (CHEMBL1670498)
IC50 6309.57±n/a nM
Citation Ray, PWright, JAdam, JBoucharens, SBlack, DBrown, AREpemolu, OFletcher, DHuggett, MJones, PLaats, SLyons, Ade Man, JMorphy, RSherborne, BSherry, LStraten, NvWestwood, PYork, M Optimisation of 6-substituted isoquinolin-1-amine based ROCK-I inhibitors. Bioorg Med Chem Lett21:1084-8 (2011) 
 
cAMP-dependent protein kinase catalytic subunit PRKX
Name:cAMP-dependent protein kinase catalytic subunit PRKX
Type:Enzyme Catalytic Domain
Mol. Mass.:40897.91
Organism:Homo sapiens (Human)
Description:gi_4826948
Residue:358
BDBM50417844
NameBDBM50417844
Synonyms:CHEMBL1667963
TypeSmall organic molecule
Emp. Form.C14H18N4O2S
Mol. Mass.306.383
SMILESNc1nccc2c(cccc12)S(=O)(=O)N1CCCNCC1