Reaction Details
TargetRho-associated protein kinase 1
LigandBDBM50417845
Substrate/Competitorn/a
Meas. Tech.ChEMBL_716634 (CHEMBL1670413)
IC50 1778.28±n/a nM
Citation Ray, PWright, JAdam, JBoucharens, SBlack, DBrown, AREpemolu, OFletcher, DHuggett, MJones, PLaats, SLyons, Ade Man, JMorphy, RSherborne, BSherry, LStraten, NvWestwood, PYork, M Optimisation of 6-substituted isoquinolin-1-amine based ROCK-I inhibitors. Bioorg Med Chem Lett21:1084-8 (2011) 
 
Rho-associated protein kinase 1
Name:Rho-associated protein kinase 1
Type:Serine/threonine-protein kinase
Mol. Mass.:158156.77
Organism:Homo sapiens (Human)
Description:Q13464
Residue:1354
BDBM50417845
NameBDBM50417845
Synonyms:CHEMBL1667964
TypeSmall organic molecule
Emp. Form.C14H16N2O
Mol. Mass.228.2896
SMILESC1CNCC(C1)Oc1ccc2cnccc2c1