Reaction Details
TargetRho-associated protein kinase 1
LigandBDBM50417843
Substrate/Competitorn/a
Meas. Tech.ChEMBL_716636 (CHEMBL1670415)
IC50 660.69±n/a nM
Citation Ray, PWright, JAdam, JBoucharens, SBlack, DBrown, AREpemolu, OFletcher, DHuggett, MJones, PLaats, SLyons, Ade Man, JMorphy, RSherborne, BSherry, LStraten, NvWestwood, PYork, M Optimisation of 6-substituted isoquinolin-1-amine based ROCK-I inhibitors. Bioorg Med Chem Lett21:1084-8 (2011) 
 
Rho-associated protein kinase 1
Name:Rho-associated protein kinase 1
Type:Serine/threonine-protein kinase
Mol. Mass.:158156.77
Organism:Homo sapiens (Human)
Description:Q13464
Residue:1354
BDBM50417843
NameBDBM50417843
Synonyms:CHEMBL1667967
TypeSmall organic molecule
Emp. Form.C14H16N2O2
Mol. Mass.244.289
SMILESO=c1[nH]ccc2cc(O[C@H]3CCCNC3)ccc12