Reaction Details
TargetRho-associated protein kinase 1
LigandBDBM50417846
Substrate/Competitorn/a
Meas. Tech.ChEMBL_716634 (CHEMBL1670413)
IC50 676.08±n/a nM
Citation Ray, PWright, JAdam, JBoucharens, SBlack, DBrown, AREpemolu, OFletcher, DHuggett, MJones, PLaats, SLyons, Ade Man, JMorphy, RSherborne, BSherry, LStraten, NvWestwood, PYork, M Optimisation of 6-substituted isoquinolin-1-amine based ROCK-I inhibitors. Bioorg Med Chem Lett21:1084-8 (2011) 
 
Rho-associated protein kinase 1
Name:Rho-associated protein kinase 1
Type:Serine/threonine-protein kinase
Mol. Mass.:158156.77
Organism:Homo sapiens (Human)
Description:Q13464
Residue:1354
BDBM50417846
NameBDBM50417846
Synonyms:CHEMBL1667968
TypeSmall organic molecule
Emp. Form.C14H16N2O2
Mol. Mass.244.289
SMILESO=c1[nH]ccc2cc(O[C@@H]3CCCNC3)ccc12