Reaction Details
TargetRho-associated protein kinase 1
LigandBDBM50417844
Substrate/Competitorn/a
Meas. Tech.ChEMBL_716633 (CHEMBL1670412)
Ki 34.67±n/a nM
Citation Ray, PWright, JAdam, JBoucharens, SBlack, DBrown, AREpemolu, OFletcher, DHuggett, MJones, PLaats, SLyons, Ade Man, JMorphy, RSherborne, BSherry, LStraten, NvWestwood, PYork, M Optimisation of 6-substituted isoquinolin-1-amine based ROCK-I inhibitors. Bioorg Med Chem Lett21:1084-8 (2011) 
 
Rho-associated protein kinase 1
Name:Rho-associated protein kinase 1
Type:Serine/threonine-protein kinase
Mol. Mass.:158156.77
Organism:Homo sapiens (Human)
Description:Q13464
Residue:1354
BDBM50417844
NameBDBM50417844
Synonyms:CHEMBL1667963
TypeSmall organic molecule
Emp. Form.C14H18N4O2S
Mol. Mass.306.383
SMILESNc1nccc2c(cccc12)S(=O)(=O)N1CCCNCC1