Reaction Details
TargetRho-associated protein kinase 1
LigandBDBM50417668
Substrate/Competitorn/a
Meas. Tech.ChEMBL_716636 (CHEMBL1670415)
IC50 5011.87±n/a nM
Citation Ray, PWright, JAdam, JBoucharens, SBlack, DBrown, AREpemolu, OFletcher, DHuggett, MJones, PLaats, SLyons, Ade Man, JMorphy, RSherborne, BSherry, LStraten, NvWestwood, PYork, M Optimisation of 6-substituted isoquinolin-1-amine based ROCK-I inhibitors. Bioorg Med Chem Lett21:1084-8 (2011) 
 
Rho-associated protein kinase 1
Name:Rho-associated protein kinase 1
Type:Serine/threonine-protein kinase
Mol. Mass.:158156.77
Organism:Homo sapiens (Human)
Description:Q13464
Residue:1354
BDBM50417668
NameBDBM50417668
Synonyms:CHEMBL1643368
TypeSmall organic molecule
Emp. Form.C14H17N3O
Mol. Mass.243.3043
SMILESNc1nccc2cc(O[C@H]3CCCNC3)ccc12