Reaction Details
TargetRho-associated protein kinase 1
LigandBDBM50417849
Substrate/Competitorn/a
Meas. Tech.ChEMBL_716634 (CHEMBL1670413)
IC50 81.28±n/a nM
Citation Ray, PWright, JAdam, JBoucharens, SBlack, DBrown, AREpemolu, OFletcher, DHuggett, MJones, PLaats, SLyons, Ade Man, JMorphy, RSherborne, BSherry, LStraten, NvWestwood, PYork, M Optimisation of 6-substituted isoquinolin-1-amine based ROCK-I inhibitors. Bioorg Med Chem Lett21:1084-8 (2011) 
 
Rho-associated protein kinase 1
Name:Rho-associated protein kinase 1
Type:Serine/threonine-protein kinase
Mol. Mass.:158156.77
Organism:Homo sapiens (Human)
Description:Q13464
Residue:1354
BDBM50417849
NameBDBM50417849
Synonyms:CHEMBL1667979
TypeSmall organic molecule
Emp. Form.C15H18N2O2
Mol. Mass.258.3156
SMILESNC[C@@H]1CC[C@@H](C1)Oc1ccc2c(cc[nH]c2=O)c1