Reaction Details
TargetRho-associated protein kinase 1
LigandBDBM50417847
Substrate/Competitorn/a
Meas. Tech.ChEMBL_716634 (CHEMBL1670413)
IC50 331.13±n/a nM
Citation Ray, PWright, JAdam, JBoucharens, SBlack, DBrown, AREpemolu, OFletcher, DHuggett, MJones, PLaats, SLyons, Ade Man, JMorphy, RSherborne, BSherry, LStraten, NvWestwood, PYork, M Optimisation of 6-substituted isoquinolin-1-amine based ROCK-I inhibitors. Bioorg Med Chem Lett21:1084-8 (2011) 
 
Rho-associated protein kinase 1
Name:Rho-associated protein kinase 1
Type:Serine/threonine-protein kinase
Mol. Mass.:158156.77
Organism:Homo sapiens (Human)
Description:Q13464
Residue:1354
BDBM50417847
NameBDBM50417847
Synonyms:CHEMBL1667970
TypeSmall organic molecule
Emp. Form.C15H18N2O2
Mol. Mass.258.3156
SMILESO=c1[nH]ccc2cc(O[C@H]3CCCNCC3)ccc12