Reaction Details
TargetProtein kinase C delta type
LigandBDBM50417844
Substrate/Competitorn/a
Meas. Tech.ChEMBL_716670 (CHEMBL1670495)
IC50 25118.86±n/a nM
Citation Ray, PWright, JAdam, JBoucharens, SBlack, DBrown, AREpemolu, OFletcher, DHuggett, MJones, PLaats, SLyons, Ade Man, JMorphy, RSherborne, BSherry, LStraten, NvWestwood, PYork, M Optimisation of 6-substituted isoquinolin-1-amine based ROCK-I inhibitors. Bioorg Med Chem Lett21:1084-8 (2011) 
 
Protein kinase C delta type
Name:Protein kinase C delta type
Type:Enzyme
Mol. Mass.:77516.79
Organism:Homo sapiens (Human)
Description:The recombinant human PKC enzymes were produced using a baculovirus expression system in SF9 cells
Residue:676
BDBM50417844
NameBDBM50417844
Synonyms:CHEMBL1667963
TypeSmall organic molecule
Emp. Form.C14H18N4O2S
Mol. Mass.306.383
SMILESNc1nccc2c(cccc12)S(=O)(=O)N1CCCNCC1