Reaction Details
TargetGlucocorticoid receptor
LigandBDBM50417875
Substrate/Competitorn/a
Meas. Tech.ChEMBL_716756 (CHEMBL1670638)
IC50 0.0794±n/a nM
Citation Diallo, HAngell, DCBarnett, HABiggadike, KCoe, DMCooper, TWCraven, AGray, JRHouse, DJack, TIKeeling, SPMacdonald, SJMcLay, IMOliver, STaylor, SJUings, IJWellaway, N Discovery of a potent series of non-steroidal nona-trifluoromethyl carbinol glucocorticoid receptor agonists with reduced lipophilicity. Bioorg Med Chem Lett21:1126-33 (2011) 
 
Glucocorticoid receptor
Name:Glucocorticoid receptor
Type:Enzyme
Mol. Mass.:85656.87
Organism:Homo sapiens (Human)
Description:P04150
Residue:777
BDBM50417875
NameBDBM50417875
Synonyms:CHEMBL1668063
TypeSmall organic molecule
Emp. Form.C26H22Cl2F4N4O2
Mol. Mass.569.378
SMILESCCN(C[C@](O)(CNc1cccc2n(ncc12)-c1ccc(F)cc1)C(F)(F)F)C(=O)c1c(Cl)cccc1Cl